{"text_format":"1","workbook":"xlsx","n_sheets":13,"sheets":["Makró1","Azonosítás","Nyilatkozat","Partnerek","Ki- és beutazó hallgatók","Ki- és beutazó okt, személyzet","Pénzügyi elszámolás","Pályázói adatok","Segédadatok","Segédadatok2","ráták","Erasmus_kodok","Munka1"],"not_rendered":{"charts":0,"images":0,"macros":0,"external_links":0,"defined_names":108,"comments":6,"pivot_tables":0},"unopened":[],"bounds":{"document_bytes":16777216,"sheet_cells":100000,"rows_first":2000,"rows_last":500,"rows_between":2000,"halvings":0,"cell_chars":16384,"cell_head_chars":4096},"cells_cut":0,"cells_raw":0,"read":"whole","date_system":"1900"}

{"sheet":"Makró1","index":0,"n_rows":0,"n_cols":0,"rows_kept":0,"cut":false,"hidden":true,"merged":[]}

{"sheet":"Azonosítás","index":1,"n_rows":37,"n_cols":3,"rows_kept":37,"cut":false,"hidden":false,"merged":[[36,0,36,2],[5,0,5,2],[11,0,11,2],[34,0,34,2],[2,0,2,2],[3,0,3,2],[7,0,7,2],[8,0,8,2],[10,0,10,2],[6,0,6,2],[4,0,4,2],[35,0,35,2],[31,0,31,2],[32,0,32,2],[33,0,33,2]]}
[]
[null,"Beszámoló típusa:","Verzió: 2.0"]
[]
[]
["Szerződésszám:"]
[]
[]
[{"$f":"IF(A9=\"\",\"\",\"Intézmény neve:\")","v":""}]
[{"$f":"IFERROR(INDEX('Pályázói adatok'!A2:C10,MATCH($A$6,'Pályázói adatok'!A2:A10),3),\"\")","v":""}]
[]
{"$rows_left_out":28}
{"sheet":"Nyilatkozat","index":2,"n_rows":28,"n_cols":6,"rows_kept":28,"cut":false,"hidden":false,"merged":[[27,5,27,7],[17,0,18,7],[14,0,16,7],[22,4,22,6],[1,0,1,7],[3,0,3,7],[5,0,7,7],[9,0,12,7],[21,4,21,6],[25,4,25,6]]}
[]
["Nyilatkozat"]
[]
[]
[]
["Alulírott, mint a pályázó intézmény hivatalos képviselője aláírásommal igazolom, hogy a beszámolóban megadott adatok – legjobb tudomásom és ismereteim szerint – valósak és helytállók, a mobilitásban részt vevőkkel a szükséges szerződéseket minden esetben megkötöttük."]
[]
[]
[]
["Aláírásommal hozzájárulok, hogy a Tempus Közalapítvány a beszámolóban megadott adatokat kizárólag a beszámoló feldolgozása  érdekében kezelje, feldolgozza és azokat legalább 5 évig megőrizze. Hozzájárulok ahhoz, hogy az adatok feldolgozását követően az intézmény e beszámolóban feltüntetett főbb adatait a Tempus Közalapítvány nyilvánosságra hozza. "]
{"$rows_left_out":19}
{"sheet":"Partnerek","index":3,"n_rows":108,"n_cols":17,"rows_kept":108,"cut":false,"hidden":false,"merged":[[2,3,2,4],[3,3,3,4]]}
[]
[null,null,"Intézményi partnerek"]
[]
[null,null,null,"EGT koordinátor aláírása"]
[null,null,"Intézmény neve:",{"$f":"IFERROR(IF(Azonosítás!$A$9=\"\",\"\",Azonosítás!$A$9),\"\")","v":""}]
[null,null,"Szerződésszám:",{"$f":"IFERROR(Azonosítás!$A$6,\"\")","v":0},{"$f":"TODAY()","v":"2017-01-06"}]
[]
["Partnerazonosító","Partner Erasmus-kódja","Partner hivatalos neve (eredeti neve)","Partner angol neve","Intézmény típusa","Tevékenység jellege","Jogi státusz","Gazdasági\nágazat","Irányító-\nszám","Város","Ország","NUTS kód","Adószám","Kétoldalú egyezmény létrejötte (ÉÉÉÉ/HH/NN)","Partner kontaktszemély neve","Partnerszemély telefonszáma","Partner kontaktszemély e-mailcíme"]
[{"$f":"IF(Azonosítás!A9=\"\",\"\",Azonosítás!$A$9)","v":""},null,{"$f":"IF(Azonosítás!$A$9=\"\",\"\",Azonosítás!$A$9)","v":""},null,null,null,null,null,null,null,{"$f":"IF(A9<>\"\",\"HU\",\"\")","v":""},null,null,{"$f":"IF(C9<>\"\",\"---\",\"\")","v":""},null,null,{"$f":"IFERROR(IF(B9<>\"\",VLOOKUP(B9,'Pályázói adatok'!B:BD,52,FALSE),\"\"),\"\")","v":""}]
[]
{"$rows_left_out":99}
{"sheet":"Ki- és beutazó hallgatók","index":4,"n_rows":108,"n_cols":37,"rows_kept":108,"cut":false,"hidden":true,"merged":[[2,4,2,7],[2,14,2,17],[3,4,3,7],[3,14,3,17]]}
[{"$f":"IF(Azonosítás!A3=\"\",\"\",Azonosítás!A3)","v":""}]
["Ki- és beutazó hallgatói mobilitás - tanulmányi célú, szakmai gyakorlat, nyári egyetem"]
[]
["Intézmény neve:",null,{"$f":"IF(Azonosítás!A9=\"\",\"\",Azonosítás!A9)","v":""},null,"EGT koordinátor aláírása",null,null,null,null,null,null,null,null,null,"intézményi koordinátor aláírása"]
["Szerződésszám:",null,{"$f":"Azonosítás!A6","v":0},null,null,null,null,{"$f":"TODAY()","v":"2017-01-06"},null,null,null,null,null,null,null,null,null,{"$f":"TODAY()","v":"2017-01-06"}]
[null,null,null,null,null,null,null,null,null,null,null,null,null,null,null,null,0]
[]
["Mobilitás jellege","Egyéni támogatási szerződésszám","Tanulmányi \nazonosító kód","Családnév","Keresztnév","Születés időpontja\n(ÉÉÉÉ/HH/NN)","Neme","Állampolgárság","Szakterület kódja","Leendő végzettsége (magyarul)","A tanulmányok szintje ","Évfolyam","Küldő partner azonosítója","Fogadó partner azonosítója","Tanulmányi célú mobilitás \nkezdete\n (ÉÉÉÉ/HH/NN)","Tanulmányi célú mobilitás \nvége\n (ÉÉÉÉ/HH/NN)","Tanulmányi célú mobilitás hossza","Szakmai gyakorlat  \nkezdete\n (ÉÉÉÉ/HH/NN)","Szakmai gyakorlat  \nvége\n (ÉÉÉÉ/HH/NN)","Szakmai \ngyakorlat  hossza","Nyári egyetem \nkezdete\n (ÉÉÉÉ/HH/NN)","Nyári egyetem\nvége\n (ÉÉÉÉ/HH/NN)","Nyári egyetem hossza","Tanulmányi ECTS kreditek száma","Gyakorlati ECTS kreditek száma","Oktatás vagy munka nyelve","Hallgatói felkészítés","EGT ösztöndíj összesen (EUR)","Intézményi forrás \n(HUF)","Hallgató e-mail címe ","Költségtérítéses hallgató?","Megjegyzés","hosszabbítási igény \n(hónap)","kiegészítés-igény \n(euró)","Küldő ország","Fogadó ország","TÁMOGATÁS"]
[null,null,null,null,null,null,null,null,null,null,null,null,{"$f":"IF((IFERROR(RIGHT($A9,2),\"\")=\"KI\"),Erasmus_kod,\"\")","v":""},null,null,null,null,null,null,null,null,null,null,null,null,null,null,{"$f":"IFERROR(\n   IF( ((RIGHT(A9,2)=\"KI\")*(AI9=\"HU\")*(AJ9<>\"HU\"))+((RIGHT(A9,2)=\"BE\")*(AJ9=\"HU\")*(AJ9=\"HU\")),  IF(A9<>\"\",AK9,\"\"),\"\"),\"\")","v":""},null,null,null,null,null,null,{"$f":"IFERROR(\nIF(VLOOKUP($M9,Partnerek!$A$9:$K$108,11,FALSE)=\"\",\"\",VLOOKUP($M9,Partnerek!$A$9:$K$108,11,FALSE)),\"\")","v":""},{"$f":"IFERROR(\nIF(VLOOKUP($N9,Partnerek!$A$9:$K$108,11,FALSE)=\"\",\"\",VLOOKUP($N9,Partnerek!$A$9:$K$108,11,FALSE)),\"\")","v":""},{"$f":"IFERROR(VLOOKUP(AJ9,ráták!$A$10:$AX$13,MATCH(Q9+T9+W9,ráták!$C$9:$AX$9,1)+2,FALSE),\"\")","v":""}]
[null,null,null,null,null,null,null,null,null,null,null,null,"",null,null,null,null,null,null,null,null,null,null,null,null,null,null,{"$f":"IFERROR(\n   IF( ((RIGHT(A10,2)=\"KI\")*(AI10=\"HU\")*(AJ10<>\"HU\"))+((RIGHT(A10,2)=\"BE\")*(AJ10=\"HU\")*(AJ10=\"HU\")),  IF(A10<>\"\",AK10,\"\"),\"\"),\"\")","v":""},null,null,null,null,null,null,{"$f":"IFERROR(\nIF(VLOOKUP($M10,Partnerek!$A$9:$K$108,11,FALSE)=\"\",\"\",VLOOKUP($M10,Partnerek!$A$9:$K$108,11,FALSE)),\"\")","v":""},{"$f":"IFERROR(\nIF(RIGHT($A10,2)=\"BE\",\"HU\",\nIF(VLOOKUP($N10,Partnerek!$A$9:$K$108,11,FALSE)=\"\",\"\",VLOOKUP($N10,Partnerek!$A$9:$K$108,11,FALSE))),\"\")","v":""},{"$f":"IFERROR(VLOOKUP(AJ10,ráták!$A$10:$AX$13,MATCH(Q10+T10+W10,ráták!$C$9:$AX$9,1)+2,FALSE),\"\")","v":""}]
{"$rows_left_out":99}
{"sheet":"Ki- és beutazó okt, személyzet","index":5,"n_rows":108,"n_cols":27,"rows_kept":108,"cut":false,"hidden":false,"merged":[[2,5,2,8],[3,5,3,8],[4,8,4,9]]}
[{"$f":"IF(Azonosítás!A3=\"\",\"\",Azonosítás!A3)","v":""}]
["Oktatói mobilitás - ki- és beutazó oktatók, személyzet"]
[]
["Intézmény neve:",null,{"$f":"IF(Azonosítás!A9=\"\",\"\",Azonosítás!A9)","v":""},null,null,"EGT koordinátor aláírása"]
["Szerződésszám:",null,{"$f":"Azonosítás!A6","v":0},null,null,null,null,null,{"$f":"TODAY()","v":"2017-01-06"}]
[]
[]
["Mobilitás jellege","Tevékenység jellege","Egyéni támogatási szerződésszám","Családnév","Keresztnév","Születés időpontja\n(ÉÉÉÉ/HH/NN)","Neme","Állampolgárság","Szakterület kódja","Tapasztaltság\n(csak  oktatás!)","Feladatkör","Oktatás\nszintje a küldő intézményben","Küldő partner azonosítója","Fogadó partner azonosítója","Mobilitás kezdete\n (ÉÉÉÉ/HH/NN)","Mobilitás vége\n (ÉÉÉÉ/HH/NN)","Mobilitás\nidőtartama napokban \n(utazással együtt)","Oktatott órák száma összesen","A külföldi oktatás\nszintje","Oktatás vagy munka \nnyelve","EGT támogatás összesen (euró)","Intézményi forrás (HUF), ha volt","Résztvevő e-mail címe ","Megjegyzés","Küldő ország","Fogadó ország","TÁMOGATÁS"]
[null,null,null,null,null,null,null,null,null,null,null,null,null,null,null,null,{"$f":"IFERROR(IF(P9<=O9,\"\",IF( (P9-O9+1)>42,\"\",P9-O9+1)),\"\")","v":""},null,null,null,{"$f":"IFERROR(\n   IF( ((RIGHT(A9,2)=\"KI\")*(Y9=\"HU\")*(Z9<>\"HU\"))+((RIGHT(A9,2)=\"BE\")*(Y9<>\"HU\")*(Z9=\"HU\")),  IF(A9<>\"\",AA9,\"\"),\"\"),\"\")","v":""},null,null,null,{"$f":"IFERROR(\nIF(VLOOKUP($M9,Partnerek!$A$9:$K$108,11,FALSE)=\"\",\"\",VLOOKUP($M9,Partnerek!$A$9:$K$108,11,FALSE)),\"\")","v":""},{"$f":"IFERROR(\nIF(VLOOKUP($N9,Partnerek!$A$9:$K$108,11,FALSE)=\"\",\"\",VLOOKUP($N9,Partnerek!$A$9:$K$108,11,FALSE)),\"\")","v":""},{"$f":"IFERROR(VLOOKUP(Z9,ráták!$A$3:$AR$6,MATCH($Q9,ráták!$C$2:$AR$2,1)+2,FALSE),\"\")","v":""}]
[null,null,null,null,null,null,null,null,null,null,null,null,{"$f":"IF((IFERROR(RIGHT($A10,2),\"\")=\"KI\"),Azonosítás!$A$9,\"\")","v":""},null,null,null,{"$f":"IFERROR(IF(P10<=O10,\"\",IF( (P10-O10+1)>42,\"\",P10-O10+1)),\"\")","v":""},null,null,null,{"$f":"IFERROR(\n   IF( ((RIGHT(A10,2)=\"KI\")*(Y10=\"HU\")*(Z10<>\"HU\"))+((RIGHT(A10,2)=\"BE\")*(Y10<>\"HU\")*(Z10=\"HU\")),  IF(A10<>\"\",AA10,\"\"),\"\"),\"\")","v":""},null,null,null,{"$f":"IFERROR(\nIF(VLOOKUP($M10,Partnerek!$A$9:$K$108,11,FALSE)=\"\",\"\",VLOOKUP($M10,Partnerek!$A$9:$K$108,11,FALSE)),\"\")","v":""},{"$f":"IFERROR(\nIF(VLOOKUP($N10,Partnerek!$A$9:$K$108,11,FALSE)=\"\",\"\",VLOOKUP($N10,Partnerek!$A$9:$K$108,11,FALSE)),\"\")","v":""},{"$f":"IFERROR(VLOOKUP(Z10,ráták!$A$3:$AR$6,MATCH($Q10,ráták!$C$2:$AR$2,1)+2,FALSE),\"\")","v":""}]
{"$rows_left_out":99}
{"sheet":"Pénzügyi elszámolás","index":6,"n_rows":46,"n_cols":14,"rows_kept":46,"cut":false,"hidden":false,"merged":[[43,1,43,3],[44,1,44,3],[38,1,38,3],[45,1,45,3],[39,1,39,3],[42,1,42,3],[40,1,40,3],[41,1,41,3],[36,1,36,3],[37,1,37,3],[4,12,5,12],[3,1,3,2],[4,7,4,9],[35,1,35,3],[25,1,26,3],[25,4,26,9],[4,4,4,6],[0,1,0,11],[2,1,2,2],[2,3,2,9],[4,11,5,11],[4,10,5,10],[1,3,1,9]]}
[null,{"$f":"IF(Azonosítás!A3=\"\",\"\",Azonosítás!A3)","v":""}]
[]
[null,"Intézmény neve:",null,{"$f":"IF(Azonosítás!A9=\"\",\"\",Azonosítás!A9)","v":""}]
[null,"Szerződésszám:",null,{"$f":"Azonosítás!A6","v":0}]
[null,null,null,null,"Hallgatók",null,null,"Oktatói, személyzeti mobilitás",null,null,"Felkészítés","Mobilitás \nszervezése","Összesen"]
[null,"Szerződéses adatok",null,null,"Tanulmányok","Gyakorlat","Nyári egyetem","Oktatás","Konferencia, tréning","Intézménylátogatás"]
[null,"Megítélt támogatás összege",null,null,{"$f":"VLOOKUP($D$4,Alapadatok,6,FALSE)","v":{"$error":"#N/A"}},{"$f":"VLOOKUP($D$4,Alapadatok,7,FALSE)","v":{"$error":"#N/A"}},{"$f":"VLOOKUP($D$4,Alapadatok,8,FALSE)","v":{"$error":"#N/A"}},{"$f":"VLOOKUP($D$4,'Pályázói adatok'!A2:BG10,9,FALSE)","v":{"$error":"#N/A"}},{"$f":"VLOOKUP($D$4,'Pályázói adatok'!A2:BG10,10,FALSE)","v":{"$error":"#N/A"}},{"$f":"VLOOKUP($D$4,'Pályázói adatok'!A2:BG10,11,FALSE)","v":{"$error":"#N/A"}},{"$f":"VLOOKUP($D$4,Alapadatok,12,FALSE)","v":{"$error":"#N/A"}},{"$f":"VLOOKUP($D$4,'Pályázói adatok'!A2:BG10,13,FALSE)","v":{"$error":"#N/A"}},{"$f":"VLOOKUP($D$4,'Pályázói adatok'!A2:BG10,14,FALSE)","v":{"$error":"#N/A"}}]
[null,"Évközi módosítás összege (+/-)",null,null,0,0,0,0,0,null,0,0,{"$f":"SUM(E8:L8)","v":0}]
[null,"Megítélt összesen",null,null,{"$f":"E7+E8","v":{"$error":"#N/A"}},{"$error":"#N/A"},{"$error":"#N/A"},{"$error":"#N/A"},{"$error":"#N/A"},{"$error":"#N/A"},{"$error":"#N/A"},{"$error":"#N/A"},{"$error":"#N/A"}]
[null,"Megkötött szerződés(ek) összege (FOI - TKA)",null,null,null,null,null,null,null,null,null,null,{"$f":"SUM(E10:L10)","v":0}]
{"$rows_left_out":37}
{"sheet":"Pályázói adatok","index":7,"n_rows":11,"n_cols":59,"rows_kept":11,"cut":false,"hidden":true,"merged":[]}
["Szerzodesszam","Erasmus_ID","Intezmeny","Város","EUC_szam","SMS","SMP","SMS SU","Oktatás","Konferencia, szeminárium, tréning","Intézmény-látogatás","Felkészítési ktg","Mobilitás-szervezés","Összes elnyert","80%",0.1,"Utolsó részlet","Jóváhagyott fő (SMS_KI)","Elvárt hó \n(SMS_KI)","Jóváhagyott fő (SMS_BE)","Elvárt hó \n(SMS_BE)","Jóváhagyott fő (SMP_KI)","Elvárt hó \n(SMP_KI)","Jóváhagyott fő (SMP_BE)","Elvárt hó \n(SMP_BE)","Jóváhagyott fő (SMS_SU_KI)","Elvárt hó \n(SMS_SU_ki)","Jóváhagyott fő (SMS_SU_BE)","Elvárt hó \n(SMS_SU_BE)","Jóváhagyott fő \n(oktatás_ki)","Elvárt nap \n(oktatás_ki)","Jóváhagyott fő \n(oktatás_be)","Elvárt nap \n(oktatás_be)","Jóváhagyott fő (konf_ki)","Elvárt nap \n(konf_ki)","Jóváhagyott fő (konf_be)","Elvárt nap \n(konf_be)","Jóváhagyott fő (int.lát_ki)","Elvárt nap \n(int.lát_ki)","Jóváhagyott fő (int.lát_be)","Elvárt nap \n(int.lát_be)","Jóváhagyott fő\nÖSSZES","Mobilitas\nAzonosito","Eloiranyzat\nAzonosito","Appid","Intézmény-\ntípus","Működési\nforma","Jogi\nstátusz","Gazdasági\nszektor","Méret \n(dolgozók)","Méret\n(tanulók)  ","Kapcsolattartó telefon","Kapcsolattartó E-mail","Irányítószám","Város","Ország","Régió","Projektkód","Felkészítés"]
["EGT/156/M3-0006",null,"Baranya Megyei Önkormányzat Közegészségügyi, Narkomán Fiatalokat Gyógyító- Foglalkoztató Közalapítványa (Indít Alapítvány)","Pécs",null,null,null,null,0,1458,6500,null,700,8658,6926,null,null,null,null,null,null,null,null,null,null,null,null,null,null,0,0,0,0,0,0,2,4,5,7,0,0,7,2027479826,-94631510,"d80140e2-27e6-4768-af89-b26017bcca4d_2013",null,null,null,null,null,null,3672315083,"inditkozalap@gmail.com","7623","Pécs","HU"]
["EGT/156/M3-0007",null,"Magyar Cukrász Iparosok Országos Ipartestülete","Budapest",null,null,null,null,14056,0,18882,null,2200,35138,28110,null,null,null,null,null,null,null,null,null,null,null,null,null,null,8,11,0,0,0,0,0,0,6,12,8,8,22,-30675898,-94631510,"c580e703-7283-4bb9-9492-3fa406afde8c_2013",null,null,null,null,null,null,3612664165,"avojtek20@gmail.com","1053","Budapest","HU"]
["EGT/156/M3-0008",null,"Balassi Bálint Nyolcévfolyamos Gimnázium","Budapest",null,null,null,null,0,0,2100,null,100,2200,1760,null,null,null,null,null,null,null,null,null,null,null,null,null,null,0,0,0,0,0,0,0,0,1,14,0,0,1,102318837,-94631510,"8c504fa2-ae5c-44f2-a2bf-8708d8d855b4_2013",null,null,null,null,null,null,"36 16322858","andi3560@gmail.com","1174","Budapest","HU"]
["EGT/156/M3-0009",null,"Georgikon Görögkatolikus Mezőgazdasági és Élelmiszeripari Szakgimnázium, Szakközépiskola és Kollégium","Sátoraljaújhely",null,null,null,null,0,0,11700,null,900,12600,10080,null,null,null,null,null,null,null,null,null,null,null,null,null,null,0,0,0,0,0,0,0,0,9,7,0,0,9,73533959,-94631510,"08318f39-1944-4184-9190-a4af2d3d7cce_2013",null,null,null,null,null,null,3647523340,"szanozsu@gmail.com","3980","Sátoraljaújhely","HU"]
["EGT/156/M3-0010",null,"Váci Szakképzési Centrum Petzelt József Szakközépiskolája és Szakiskolája","Szentendre",null,null,null,null,0,0,13200,null,1200,14400,11520,null,null,null,null,null,null,null,null,null,null,null,null,null,null,0,0,0,0,0,0,0,0,6,7,6,7,12,-815439015,-94631510,"67b12a59-58a8-48f3-a7f4-944e9de6c96f_2013",null,null,null,null,null,null,3626312167,"projekt@petzeltj.hu","2000","Szentendre","HU"]
["EGT/156/M3-0011",null,"Andrássy György Katolikus Közgazdasági Középiskola","Eger",null,null,null,null,0,3058,8300,null,900,12258,9806,null,null,null,null,null,null,null,null,null,null,null,null,null,null,0,0,1,0,2,9,0,0,5,7,2,7,9,null,null,null,null,null,null,null,null,null,"+3636510060","kiralykr@gmail.com","3300","Eger"]
["EGT/156/M3-0012",null,"Magyar Hegesztéstechnikai és Anyagvizsgálati Egyesülés","Budapest",null,null,null,null,0,0,18570,null,2000,20570,16456,null,null,null,null,null,null,null,null,null,null,null,null,null,null,0,0,0,0,0,0,0,0,10,5,10,5,20,null,null,null,null,null,null,null,null,null,3617690056,"benedekj@mhte.hu","1148","Budapest","HU"]
["EGT/156/M3-0013",null,"Athéné Idegenforgalmi, Informatikai és Üzletemberképző Szakképző Iskola","Budapest",null,null,null,null,0,0,5656,null,400,6056,4845,null,null,null,null,null,null,null,null,null,null,null,null,null,null,0,0,0,0,0,0,0,0,4,8,0,0,4,null,null,null,null,null,null,null,null,null,3618872300,"t.siptaragi@gmail.com","1073","Budapest","HU"]
["EGT/156/M3-0014",null,"Jászsági Általános Iskola Bercsényi Miklós Általános Iskolai Tagintézménye","Jászberény",null,null,null,null,0,0,18300,null,1500,19800,15840,null,null,null,null,null,null,null,null,null,null,null,null,null,null,0,0,0,0,0,0,0,0,12,7,3,7,15,null,null,null,null,null,null,null,null,null,3657501730,"atikis@freemail.hu","5100","Jászberény","HU"]
{"$rows_left_out":2}
{"sheet":"Segédadatok","index":8,"n_rows":1005,"n_cols":17,"rows_kept":1005,"cut":false,"hidden":false,"merged":[]}
[null,null,"MOBILITY TYPE","Description",null,"Erasmus országkód","Országkód","Ország","Country","Code","Description","Code","Lang","ISO_orszagkodok","NACE1","Description","Napkezdes"]
[null,null,"SMS","ERASMUS Student Mobility for Studies",null,"HU","HU","Magyarország","Hungary","HU","Hungary","EN","English","AT","A","AGRICULTURE, FORESTRY AND FISHING","2014-08-01"]
[null,null,"SMP","ERASMUS Student Mobility for Placements",null,"IS","IS","Izland","Iceland","IS","Iceland","DE","German","BE","B","MINING AND QUARRYING","2014-08-02"]
[null,null,"STA","ERASMUS Staff Mobility",null,"LI","LI","Lichtenstein","Liechtenstein","LI","Liechtenstein","IS","Icelandic","BG","C","MANUFACTURING","2014-08-03"]
[null,null,"STT","ERASMUS Staff Mobility",null,"NO","NO","Norvégia","Norway","NO","Norway","NO","Norwegian","CH","D","ELECTRICITY,  GAS, STEAM AND AIR CONDITIONING SUPPLY","2014-08-04"]
[null,null,null,null,null,null,null,null,null,"XX","other","HU","Hungarian","CY","E","WATER SUPPLY; SEWERAGE, WASTE MANAGEMENT AND REMEDIATION ACTIVITIES","2014-08-05"]
[null,null,"GENDER","Description",null,null,null,null,null,null,null,"AA","Afar","CZ","F","CONSTRUCTION","2014-08-06"]
[null,null,"F","Female",null,null,null,null,null,null,null,"AB","Abkhazian","DE","G","WHOLESALE AND RETAIL TRADE; REPAIR OF MOTOR VEHICLES AND MOTORCYCLES","2014-08-07"]
[null,null,"M","Male",null,null,null,null,null,null,null,"AE","Avestan","DK","H","TRANSPORTATION AND STORAGE","2014-08-08"]
[null,null,null,null,null,null,null,null,null,null,null,"AF","Afrikaans","EE","I","ACCOMMODATION AND FOOD SERVICE ACTIVITIES","2014-08-09"]
{"$rows_left_out":996}
{"sheet":"Segédadatok2","index":9,"n_rows":44,"n_cols":10,"rows_kept":44,"cut":false,"hidden":false,"merged":[]}
["Code","Description","Magyarul","Former ERASMUS Codes",null,"ERASMUS Code","Subject Area Description","Magyarul","EquivalentISCED97","ISCED"]
[0,"General Programmes","Általános program",null,null,"01.00","Agriculture","Mezőgazdaságtan, Mezőgazdasági tudományok","NO 001","6, 62, 620, 621, 622, 623, 624, 629, 64, 640"]
[1,"Basic/broad, general programmes","Alapozó, keretprogramok",null,null,"01.10","Anthropology","Antropológia","NO 002","31, 312"]
[10,"Basic/broad, general programmes","Alapozó, keretprogramok",null,null,"01.20","Archaeology","Régészet","NO 003",225]
[9,"Personal skills","Személyiségfejlesztés",null,null,"01.30","Architecture, design and applied arts","Építészet, dizájn és alkalmazott művészetek","NO 004","58, 581, 214, 215, 219"]
[90,"Personal skills","Személyiségfejlesztés",null,null,"01.40","Area studies","Regionális tanulmányok","NO 005","3, 310, 313, 319"]
[1,"Education","Oktatás",null,null,"01.50","Business","Üzleti tudományok","NO 006","34, 340, 341, 342, 343, 344, 345, 346, 347, 349"]
[14,"Teacher training and education science","Tanárképzés, oktatástudomány",null,null,"01.60","Chemistry","Kémia","NO 007","4, 442"]
[140,"Teacher training and education science (broad programmes)","Tanárképzés, oktatástudomány","05.0; 05.1",null,"01.70","Computer sciences","Informatika","NO 008","48, 481, 482, 489"]
[141,"Teaching and training","Tanárképzés",null,null,"01.80","Cultural studies and ethnic studies","Kulturális és etnikai tanulmányok","NO 009","3, 312"]
{"$rows_left_out":35}
{"sheet":"ráták","index":10,"n_rows":47,"n_cols":50,"rows_kept":47,"cut":false,"hidden":false,"merged":[]}
["Személyzet"]
["Célország","Heti ráta",1,2,3,4,5,6,7,8,9,10,11,12,13,14,15,16,17,18,19,20,21,22,23,24,25,26,27,28,29,30,31,32,33,34,35,36,37,38,39,40,41,42]
["IS",800,614,729,843,957,1071,1186,1300,1414,1529,1642,1757,1871,1986,2100,2214,2329,2443,2557,2671,2786,2900,3014,3129,3243,3357,3471,3586,3700,3814,3929,4043,4157,4271,4386,4500,4614,4729,4843,4957,5071,5186,5200]
["LI",800,614,729,843,957,1071,1186,1300,1414,1529,1642,1757,1871,1986,2100,2214,2329,2443,2557,2671,2786,2900,3014,3129,3243,3357,3471,3586,3700,3814,3929,4043,4157,4271,4386,4500,4614,4729,4843,4957,5071,5186,5200]
["NO",800,614,729,843,957,1071,1186,1300,1414,1529,1642,1757,1871,1986,2100,2214,2329,2443,2557,2671,2786,2900,3014,3129,3243,3357,3471,3586,3700,3814,3929,4043,4157,4271,4386,4500,4614,4729,4843,4957,5071,5186,5200]
["HU",400,557,614,671,729,786,843,900,957,1014,1071,1129,1186,1243,1300,1357,1414,1471,1529,1586,1643,1700,1757,1814,1871,1929,1986,2043,2100,2157,2214,2271,2329,2386,2443,2500,2557,2614,2671,2729,2786,2843,2900]
[]
["Hallgatók"]
["Célország","Havi ráta",0.25,0.5,0.75,1,1.25,1.5,1.75,2,2.25,2.5,2.75,3,3.25,3.5,3.75,4,4.25,4.5,4.75,5,5.25,5.5,5.75,6,6.25,6.5,6.75,7,7.25,7.5,7.75,8,8.25,8.5,8.75,9,9.25,9.5,9.75,10,10.25,10.5,10.75,11,11.25,11.5,11.75,12]
["IS",900,725,950,1175,1400,{"$f":"F10+C10-500","v":1625},{"$f":" F10+D10-500","v":1850},{"$f":"F10+E10-500","v":2075},2300,{"$f":"J10+C10-500","v":2525},{"$f":"J10+D10-500","v":2750},{"$f":"J10+E10-500","v":2975},3200,{"$f":"N10+C10-500","v":3425},{"$f":"N10+D10-500","v":3650},{"$f":"N10+E10-500","v":3875},4100,{"$f":"R10+C10-500","v":4325},{"$f":"R10+D10-500","v":4550},{"$f":"R10+E10-500","v":4775},5000,{"$f":"V10+C10-500","v":5225},{"$f":"V10+D10-500","v":5450},{"$f":"V10+E10-500","v":5675},5900,{"$f":"Z10+C10-500","v":6125},{"$f":"Z10+D10-500","v":6350},{"$f":"Z10+E10-500","v":6575},6800,{"$f":"AD10+C10-500","v":7025},{"$f":"AD10+D10-500","v":7250},{"$f":"AD10+E10-500","v":7475},7700,{"$f":"AH10+C10-500","v":7925},{"$f":"AH10+D10-500","v":8150},{"$f":"AH10+E10-500","v":8375},8600,{"$f":"AL10+C10-500","v":8825},{"$f":"AL10+D10-500","v":9050},{"$f":"AL10+E10-500","v":9275},9500,{"$f":"AP10+C10-500","v":9725},{"$f":"AP10+D10-500","v":9950},{"$f":"AP10+E10-500","v":10175},10400,{"$f":"AT10+C10-500","v":10625},{"$f":"AT10+D10-500","v":10850},{"$f":"AT10+E10-500","v":11075},11300]
{"$rows_left_out":38}
{"sheet":"Erasmus_kodok","index":11,"n_rows":64,"n_cols":7,"rows_kept":64,"cut":false,"hidden":true,"merged":[]}
["EUC Reference","Organisation","ID  CODE","PIC","Country","CITY CON","ID CODE-orig"]
["29904-EPP-1-2014-1-IS-EPPKA3-ECHE","HASKOLINN A AKUREYRI","IS AKUREYR01","998776409","IS","AKUREYRI","IS AKUREYR01"]
["28340-EPP-1-2014-1-IS-EPPKA3-ECHE","HASKOLINN A BIFROST","IS BORGARN01","949615451","IS","BORGARNES","IS BORGARN01"]
["219520-EPP-1-2014-1-IS-EPPKA3-ECHE","LANDBUNADARHASKOLI ISLANDS","IS BORGARN02","988542036","IS","BORGARNES","IS BORGARN02"]
["28332-EPP-1-2014-1-IS-EPPKA3-ECHE","HASKOLI ISLANDS","IS REYKJAV01","999884246","IS","REYKJAVIK","IS REYKJAV01"]
["210431-EPP-1-2014-1-IS-EPPKA3-ECHE","HASKOLINN I REYKJAVIK EHF","IS REYKJAV05","966834406","IS","REYKJAVIK","IS REYKJAV05"]
["28354-EPP-1-2014-1-IS-EPPKA3-ECHE","ICELAND ACADEMY OF THE ARTS","IS REYKJAV06","950429378","IS","REYKJAVIK","IS REYKJAV06"]
["239835-EPP-1-2014-1-IS-EPPKA3-ECHE","HOLAR UNIVERSITY COLLEGE","IS SAUDARK01","969226426","IS","SAUDARKORKUR","IS SAUDARK01"]
["28700-EPP-1-2014-1-LI-EPPKA3-ECHE","UNIVERSITAT LIECHTENSTEIN","LI VADUZ01","974688496","LI","Liechtenstein","LI VADUZ01"]
["218548-EPP-1-2014-1-NO-EPPKA3-ECHE","HØGSKOLEN I ÅLESUND","N  ALESUND01","949513310","NO","AALESUND","N  ALESUND01"]
{"$rows_left_out":55}
{"sheet":"Munka1","index":12,"n_rows":0,"n_cols":0,"rows_kept":0,"cut":false,"hidden":false,"merged":[]}